(MeCO)2C=C(Me)O anion

Gas phase ion energetics data

Data compiled by: John E. Bartmess

Protonation reactions

C7H9O3- + Hydrogen cation = 2,4-Pentanedione, 3-acetyl-

By formula: C7H9O3- + H+ = C7H10O3

Quantity Value Units Method Reference Comment
Δr1376. ± 8.4kJ/molIMREKoppel, Taft, et al., 1994gas phase

References

Koppel, Taft, et al., 1994
Koppel, I.A.; Taft, R.W.; Anvia, F.; Zhu, S.Z.; Hu, L.Q.; Sung, K.S.; Desmarteau, D.D.; Yagupolskii, L.M., The Gas-Phase Acidities of Very Strong Neutral Bronsted Acids, J. Am. Chem. Soc., 1994, 116, 7, 3047, https://doi.org/10.1021/ja00086a038 . [all data]