pentaF-anilide anion

Gas phase ion energetics data

Data compiled by: John E. Bartmess

Protonation reactions

C6HF5N- + Hydrogen cation = Benzenamine, 2,3,4,5,6-pentafluoro-

By formula: C6HF5N- + H+ = C6H2F5N

Quantity Value Units Method Reference Comment
Δr348.6 ± 2.1kcal/molG+TSKoppel, Taft, et al., 1994gas phase
Quantity Value Units Method Reference Comment
Δr341.3 ± 2.0kcal/molIMREKoppel, Taft, et al., 1994gas phase

References

Koppel, Taft, et al., 1994
Koppel, I.A.; Taft, R.W.; Anvia, F.; Zhu, S.Z.; Hu, L.Q.; Sung, K.S.; Desmarteau, D.D.; Yagupolskii, L.M., The Gas-Phase Acidities of Very Strong Neutral Bronsted Acids, J. Am. Chem. Soc., 1994, 116, 7, 3047, https://doi.org/10.1021/ja00086a038 . [all data]