(MeNO2)2..Cl anion

Gas phase thermochemistry data

Data compiled by: John E. Bartmess

Quantity Value Units Method Reference Comment
Δfgas-119.55kcal/molTherWincel, 2003
Δfgas-119.65kcal/molTherSieck, 1985

Reaction thermochemistry data

Data compiled by: John E. Bartmess

Individual Reactions

C2H6ClN2O4- + 3Methane, nitro- = C3H9ClN3O6-

By formula: C2H6ClN2O4- + 3CH3NO2 = C3H9ClN3O6-

Quantity Value Units Method Reference Comment
Δr11.10 ± 0.50kcal/molN/AWincel, 2003gas phase
Quantity Value Units Method Reference Comment
Δr3.70kcal/molTDAsWincel, 2003gas phase

References

Wincel, 2003
Wincel, H., Gas-phase Solvation of Cl-, NO2-, CH2NO2-, CH3NO2-, and CH3NO4- by CH3NO2, Int. J. Mass Spectrom., 2003, 226, 3, 341-353, https://doi.org/10.1016/S1387-3806(03)00066-6 . [all data]

Sieck, 1985
Sieck, L.W., Thermochemistry of Solvation of NO2- and C6H5NO2- by Polar Molecules in the Vapor Phase. Comparison with Cl- and Variation with Ligand Structure., J. Phys. Chem., 1985, 89, 25, 5552, https://doi.org/10.1021/j100271a049 . [all data]