(HCl)2..Cl anion

Gas phase thermochemistry data

Data compiled by: John E. Bartmess

Quantity Value Units Method Reference Comment
Δfgas-155.9kJ/molTherYamdagni and Kebarle, 1974

References

Yamdagni and Kebarle, 1974
Yamdagni, R.; Kebarle, P., The hydrogen bond energies in ClHCl- and Cl-(HCl)n, Can. J. Chem., 1974, 52, 2449. [all data]