(H2O)4..CN anion

Gas phase ion energetics data

Data compiled by: John E. Bartmess

Electron affinity of neutral species

EAneutral (eV) Method Reference Comment
5.890 ± 0.080LPESWang, Kowalski, et al., 2010Stated EA is Vertical Detachment Energy, at 12 K.

References

Wang, Kowalski, et al., 2010
Wang, X.B.; Kowalski, K.; Wang, L.S.; Xantheas, S.S., Stepwise hydration of the cyanide anion: A temperature-controlled photoelectron spectroscopy and ab initio computational study of CN-(H2O)(n), n=2-5, J. Chem. Phys., 2010, 132, 12, 124306, https://doi.org/10.1063/1.3360306 . [all data]