(HNO3)4..NO3 anion

Gas phase thermochemistry data

Data compiled by: John E. Bartmess

Quantity Value Units Method Reference Comment
Δfgas-271.7 ± 3.6kcal/molTherWlodek, Luczynski, et al., 1980

References

Wlodek, Luczynski, et al., 1980
Wlodek, S.; Luczynski, Z.; Wincel, H., Stabilities of gas-phase NO3-.(HNO3)n,n ≤ 6, clusters, Int. J. Mass Spectrom. Ion Phys., 1980, 35, 39. [all data]