HNO3..{HBr}..NO3 anion

Gas phase thermochemistry data

Data compiled by: John E. Bartmess

Quantity Value Units Method Reference Comment
Δfgas-646. ± 15.kJ/molTherDavidson, Fehsenfeld, et al., 1977

References

Davidson, Fehsenfeld, et al., 1977
Davidson, J.A.; Fehsenfeld, F.C.; Howard, C.J., The heats of formation of NO3- and NO3- association complexes with HNO3 and HBr, Int. J. Chem. Kinet., 1977, 9, 17. [all data]