(HNO3)2..NO3 anion

Gas phase thermochemistry data

Data compiled by: John E. Bartmess

Quantity Value Units Method Reference Comment
Δfgas-182.1 ± 3.2kcal/molTherDavidson, Fehsenfeld, et al., 1977
Δfgas-179.8 ± 3.1kcal/molTherWlodek, Luczynski, et al., 1980

References

Davidson, Fehsenfeld, et al., 1977
Davidson, J.A.; Fehsenfeld, F.C.; Howard, C.J., The heats of formation of NO3- and NO3- association complexes with HNO3 and HBr, Int. J. Chem. Kinet., 1977, 9, 17. [all data]

Wlodek, Luczynski, et al., 1980
Wlodek, S.; Luczynski, Z.; Wincel, H., Stabilities of gas-phase NO3-.(HNO3)n,n ≤ 6, clusters, Int. J. Mass Spectrom. Ion Phys., 1980, 35, 39. [all data]