Carbon subsulfide

Vibrational and/or electronic energy levels

Data compiled by: Takehiko Shimanouchi

Symmetry:   Dxh     Symmetry Number σ = 2

 Sym.   No   Approximate   Selected Freq.  Infrared   Raman   Comments
 Species   type of mode   Value   Rating   Value  Phase  Value  Phase

σg+ 1 CC s-str 1663  D  ia 1663 S solid solid
σg+ 2 CS s-str 485  D  ia 485 S p solid solid
σu+ 3 CC a-str 2089  B 2088.5 VS gas  ia
σu+ 4 CS a-str 1030  B 1029.8 S gas  ia
πg 5 CCS bend 470  D  ia 470 M solid solid
πu 6 CCS bend 502  C 502 VW gas  ia
πu 7 CCC bend 94  C 94 W gas  ia

Source: Shimanouchi, 1972

References

Shimanouchi, 1972
Shimanouchi, T., Tables of Molecular Vibrational Frequencies Consolidated Volume II, J. Phys. Chem. Ref. Data, 1972, 6, 3, 993-1102. [all data]