Glyoxal-d2

Vibrational and/or electronic energy levels

Data compiled by: Takehiko Shimanouchi

Symmetry:   C2h     Symmetry Number σ = 2

 Sym.   No   Approximate   Selected Freq.  Infrared   Raman   Comments
 Species   type of mode   Value   Rating   Value  Phase  Value  Phase

ag 1 CD str 2138  D  ia OC
ag 2 CO str 1722  C  ia OC
ag 3 CD bend 1130  D  ia OC
ag 4 CC str 915  E  ia CF
ag 5 CCO deform 537  B  ia
au 6 CD bend 630  D CF ( )From the product rule
au 7 Torsion 118  B 118.2 W gas
bg 8 CD bend 911  D  ia CF ( )From the product rule
bu 9 CD str 2130  C 2130 S gas
bu 10 CO str 1710  C 1710 VS gas
bu 11 CH bend 1010  B 1010.12 M gas
bu 12 CCO deform 311  B 311.05 M gas

Source: Shimanouchi, 1972

References

Shimanouchi, 1972
Shimanouchi, T., Tables of Molecular Vibrational Frequencies Consolidated Volume II, J. Phys. Chem. Ref. Data, 1972, 6, 3, 993-1102. [all data]