Methyl-d3-germane

Vibrational and/or electronic energy levels

Data compiled by: Takehiko Shimanouchi

Symmetry:   C     Symmetry Number σ = 3

 Sym.   No   Approximate   Selected Freq.  Infrared   Raman   Comments
 Species   type of mode   Value   Rating   Value  Phase  Value  Phase

a1 1 CD3 s-str 2090  C 2091.0 S gas
a1 2 GeH3 s-str 2073  C 2073 S gas
a1 3 CD3 s-deform 978  C 977.5 S gas
a1 4 GeH3 s-deform 844  C 844.3 S gas
a1 5 CGe str 550  B 549.6 S gas
a2 6 Torsion 132  D  ia
e 7 CD3 d-str 2248  B 2247.5 S gas
e 8 GeH3 d-str 2089  B 2089.0 S gas
e 9 CD3 d-deform 1032  B 1032.0 M gas
e 10 GeH3 d-deform 904  B 903.9 S gas
e 11 CD3 rock 713  C 713 S gas
e 12 GeH3 rock 452  B 451.8 S gas

Source: Shimanouchi, 1972

References

Shimanouchi, 1972
Shimanouchi, T., Tables of Molecular Vibrational Frequencies Consolidated Volume II, J. Phys. Chem. Ref. Data, 1972, 6, 3, 993-1102. [all data]