Chloronitrate (ClO14NO2)

Vibrational and/or electronic energy levels

Data compiled by: Takehiko Shimanouchi

Symmetry:   Cs     Symmetry Number σ = 1

 Sym.   No   Approximate   Selected Freq.  Infrared   Raman   Comments
 Species   type of mode   Value   Rating   Value  Phase  Value  Phase

a' 1 NO2 a-str 1735  B 1735.4 VS gas
a' 2 NO2 s-str 1292  B 1291.9 VS gas
a' 3 OCl str 809  C 809.3 S gas
a' 4 NO2 scis 780  C 780.2 gas
a' 5 NO str 560  B 560.0 S gas
a' 6 NO2 rock 434  B 434.1 M gas
a' 7 OCl bend 270  C 270 gas
a 8 NO2 wag 711  B 710.8 W gas
a 9 OCl torsion 121  E 121 gas OC579)

Source: Shimanouchi, 1972

References

Shimanouchi, 1972
Shimanouchi, T., Tables of Molecular Vibrational Frequencies Consolidated Volume II, J. Phys. Chem. Ref. Data, 1972, 6, 3, 993-1102. [all data]