Nitric acid-d (D15NO3)

Vibrational and/or electronic energy levels

Data compiled by: Takehiko Shimanouchi

Symmetry:   Cs     Symmetry Number σ = 1

 Sym.   No   Approximate   Selected Freq.  Infrared   Raman   Comments
 Species   type of mode   Value   Rating   Value  Phase  Value  Phase

a' 1 OD str 2622  B 2621.9 M gas
a' 2 NO2 a-str 1656  B 1655.5 VS gas
a' 3 NO2 s-str 1291  B 1290.7 S gas
a' 4 OD bend 1012  B 1011.5 M gas
a' 5 NO2 scis 873  B 876.3 S gas
a' 6 NO str 641  B 640.9 S gas
a' 7 NO2 rock 541  B 541.0 VW gas
a 8 NO2 wag 743  B 743.4 S gas
a 9 Torsion 345  D OV79, ν89)

Source: Shimanouchi, 1972

References

Shimanouchi, 1972
Shimanouchi, T., Tables of Molecular Vibrational Frequencies Consolidated Volume II, J. Phys. Chem. Ref. Data, 1972, 6, 3, 993-1102. [all data]