Germyl bromide-d3

Vibrational and/or electronic energy levels

Data compiled by: Takehiko Shimanouchi

Symmetry:   C     Symmetry Number σ = 3

 Sym.   No   Approximate   Selected Freq.  Infrared   Raman   Comments
 Species   type of mode   Value   Rating   Value  Phase  Value  Phase

a1 1 GeD3 s-str 1514  C 1514 gas
a1 2 GeD3 s-deform 596  C 596 gas
a1 3 GeBr str 305  C 305 gas
e 4 GeD3 d-str 1530  C 1530 gas
e 5 GeD3 d-deform 621  C 621 gas
e 6 GeD3 rock 420  C 420 gas

Source: Shimanouchi, 1972

References

Shimanouchi, 1972
Shimanouchi, T., Tables of Molecular Vibrational Frequencies Consolidated Volume II, J. Phys. Chem. Ref. Data, 1972, 6, 3, 993-1102. [all data]