Germyl fluoride-d3

Vibrational and/or electronic energy levels

Data compiled by: Takehiko Shimanouchi

Symmetry:   C     Symmetry Number σ = 3

 Sym.   No   Approximate   Selected Freq.  Infrared   Raman   Comments
 Species   type of mode   Value   Rating   Value  Phase  Value  Phase

a1 1 GeD3 s-str 1525  C 1525 gas
a1 2 GeD3 s-deform 696  B 696 gas
a1 3 GeF str 618  C 618 gas
e 4 GeD3 d-str 1535  B 1535 gas
e 5 GeD3 d-deform 635  C 635 gas
e 6 GeD3 rock 466  C 466 gas

Source: Shimanouchi, 1972

References

Shimanouchi, 1972
Shimanouchi, T., Tables of Molecular Vibrational Frequencies Consolidated Volume II, J. Phys. Chem. Ref. Data, 1972, 6, 3, 993-1102. [all data]