Osmium tetroxide (Os16O4)

Vibrational and/or electronic energy levels

Data compiled by: Takehiko Shimanouchi

Symmetry:   Td     Symmetry Number σ = 12

 Sym.   No   Approximate   Selected Freq.  Infrared   Raman   Comments
 Species   type of mode   Value   Rating   Value  Phase  Value  Phase

a1 1 Sym str 965  B  ia 965.2 gas
e 2 Deg deform 333  B  ia 333.1 gas
f2 3 Deg str 960  B 960.5 gas 960.1 gas
f2 4 Deg deform 329  B 329.0 gas 322.7 gas

Source: Shimanouchi, 1972

References

Shimanouchi, 1972
Shimanouchi, T., Tables of Molecular Vibrational Frequencies Consolidated Volume II, J. Phys. Chem. Ref. Data, 1972, 6, 3, 993-1102. [all data]