Hydrazoic acid

Vibrational and/or electronic energy levels

Data compiled by: Takehiko Shimanouchi

Symmetry:   Cs     Symmetry Number σ = 1

 Sym.   No   Approximate   Selected Freq.  Infrared   Raman   Comments
 Species   type of mode   Value   Rating   Value  Phase  Value  Phase

a' 1 ND str 2478  B 2478 M gas
a' 2 N≡N str 2112  C 2112 VS gas FR34)
a' 3 ND bend 954  B 953.8 S gas
a' 4 N-N str 1184  B 1183.7 M gas
a' 5 NNN bend 492  B 492.2 W gas
a 6 NNN bend 588  B 588.4 VW gas

Source: Shimanouchi, 1972

References

Shimanouchi, 1972
Shimanouchi, T., Tables of Molecular Vibrational Frequencies Consolidated Volume II, J. Phys. Chem. Ref. Data, 1972, 6, 3, 993-1102. [all data]