Nitryl fluoride (F14NO2)

Vibrational and/or electronic energy levels

Data compiled by: Takehiko Shimanouchi

Symmetry:   C     Symmetry Number σ = 2

 Sym.   No   Approximate   Selected Freq.  Infrared   Raman   Comments
 Species   type of mode   Value   Rating   Value  Phase  Value  Phase

a1 1 NO2 s-str 1310  B 1309.6 VS gas
a1 2 NF str 822  B 822.4 VS gas
a1 3 NO2 scis 568  C 567.8 S gas
b1 4 NO2 a-str 1792  B 1791.5 VS gas
b1 5 NO2 rock 560  C 559.6 S gas
b2 6 Op-deform 742  B 742.0 M gas

Source: Shimanouchi, 1972

References

Shimanouchi, 1972
Shimanouchi, T., Tables of Molecular Vibrational Frequencies Consolidated Volume II, J. Phys. Chem. Ref. Data, 1972, 6, 3, 993-1102. [all data]