Ammonia-t3

Vibrational and/or electronic energy levels

Data compiled by: Takehiko Shimanouchi

Symmetry:   C     Symmetry Number σ = 3

 Sym.   No   Approximate   Selected Freq.  Infrared   Raman   Comments
 Species   type of mode   Value   Rating   Value  Phase  Value  Phase

a1 1 Sym str 2014  A 2014.1 gas
a1 2 Sym deform 657  B 656.4 gas symmetric level
a1 2 Sym deform 657  B 657.2 gas antisymmetric level
e 3 Deg str 2185  A 2184.8 gas
e 4 Deg deform 996  A 996.3 gas

Source: Shimanouchi, 1972

References

Shimanouchi, 1972
Shimanouchi, T., Tables of Molecular Vibrational Frequencies Consolidated Volume II, J. Phys. Chem. Ref. Data, 1972, 6, 3, 993-1102. [all data]