Boron trifluoride (11BF3)

Vibrational and/or electronic energy levels

Data compiled by: Takehiko Shimanouchi

Symmetry:   D3h     Symmetry Number σ = 6

 Sym.   No   Approximate   Selected Freq.  Infrared   Raman   Comments
 Species   type of mode   Value   Rating   Value  Phase  Value  Phase

a1' 1 Sym str 888  B  ia 888 VS gas
a2 2 Op-deform 691  A 691.2 S gas  ia
e' 3 Deg str 1449  B 1449 S gas 1448 VW gas
e' 4 Deg str 480  B 480.4 M gas 482 b gas

Source: Shimanouchi, 1972

References

Shimanouchi, 1972
Shimanouchi, T., Tables of Molecular Vibrational Frequencies Consolidated Volume II, J. Phys. Chem. Ref. Data, 1972, 6, 3, 993-1102. [all data]