Nitrosyl chloride (18O14NCl)

Vibrational and/or electronic energy levels

Data compiled by: Takehiko Shimanouchi

Symmetry:   Cs     Symmetry Number σ = 1

 Sym.   No   Approximate   Selected Freq.  Infrared   Raman   Comments
 Species   type of mode   Value   Rating   Value  Phase  Value  Phase

a' 1 NO str 1751  C 1752.7 VS gas
a' 1 NO str 1751  C 1749.0 VS gas
a' 2 NCl str 588  C 588.4 VS gas
a' 3 Bend 325  C 324.9 VS gas

Source: Shimanouchi, 1972

References

Shimanouchi, 1972
Shimanouchi, T., Tables of Molecular Vibrational Frequencies Consolidated Volume II, J. Phys. Chem. Ref. Data, 1972, 6, 3, 993-1102. [all data]