Nitrogen dioxide (15NO2)

Vibrational and/or electronic energy levels

Data compiled by: Takehiko Shimanouchi

Symmetry:   C     Symmetry Number σ = 2

 Sym.   No   Approximate   Selected Freq.  Infrared   Raman   Comments
 Species   type of mode   Value   Rating   Value  Phase  Value  Phase

a1 1 Sym str 1306  B 1306 W gas
a1 2 Bend 740  B 740.2 S gas
b1 3 Anti str 1580  B 1580.3 VS gas

Source: Shimanouchi, 1972

References

Shimanouchi, 1972
Shimanouchi, T., Tables of Molecular Vibrational Frequencies Consolidated Volume II, J. Phys. Chem. Ref. Data, 1972, 6, 3, 993-1102. [all data]