trans-1,2-Dichloroethylene-d2

Vibrational and/or electronic energy levels

Data compiled by: Takehiko Shimanouchi

Symmetry:   C2h     Symmetry Number σ = 2

 Sym.   No   Approximate   Selected Freq.  Infrared   Raman   Comments
 Species   type of mode   Value   Rating   Value  Phase  Value  Phase

ag 1 CD str 2325  C  ia 2325 S liq.
ag 2 CC str 1570  C  ia 1570 S liq.
ag 3 CD bend 992  C  ia 992 S liq.
ag 4 CCl str 765  C  ia 765 M liq.
ag 5 CCCl deform 346  C  ia 346 S liq.
au 6 CD bend 660  B 660 S gas  ia
au 7 Torsion 221  E  ia CF
bg 8 CD bend 657  C  ia 657 M liq.
bu 9 CD str 2290  C 2290 S gas  ia
bu 10 CD bend 916  C 916 VS gas  ia
bu 11 CCl str 791  C 791 VS gas  ia
bu 12 CCCl deform 240  E  ia CF

Source: Shimanouchi, 1972

References

Shimanouchi, 1972
Shimanouchi, T., Tables of Molecular Vibrational Frequencies Consolidated Volume I, National Bureau of Standards, 1972, 1-160. [all data]