Formaldehyde-d1

Vibrational and/or electronic energy levels

Data compiled by: Takehiko Shimanouchi

Symmetry:   Cs     Symmetry Number σ = 1

 Sym.   No   Approximate   Selected Freq.  Infrared   Raman   Comments
 Species   type of mode   Value   Rating   Value  Phase  Value  Phase

a' 1 CH str 2844  D 2844.1 S gas 2846.2 S liq. FR35)
a' 2 CD str 2121  D 2120.7 S gas 2120.3 S liq. FR(2ν6+2ν5)
a' 3 CO str 1723  A 1723.4 VS gas 1723.2 VS liq.
a' 4 CHD scis 1400  B 1400.0 S gas 1397.4 M liq.
a' 5 CHD rock 1041  D 1041 S gas
a 6 CHD wag 1074  C 1074 S gas

Source: Shimanouchi, 1972

References

Shimanouchi, 1972
Shimanouchi, T., Tables of Molecular Vibrational Frequencies Consolidated Volume I, National Bureau of Standards, 1972, 1-160. [all data]