Cyanogen bromide (70BrCN)

Vibrational and/or electronic energy levels

Data compiled by: Takehiko Shimanouchi

Symmetry:   C∞ν     Symmetry Number σ = 1

 Sym.   No   Approximate   Selected Freq.  Infrared   Raman   Comments
 Species   type of mode   Value   Rating   Value  Phase  Value  Phase

σ+ 1 CN str 2198  A 2198.3 gas 2191 liq.
π 2 Bend 342  A 341.5 gas 357 liq. RP
σ+ 3 CBr str 575  C 575 gas 568 liq.

Source: Shimanouchi, 1972

References

Shimanouchi, 1972
Shimanouchi, T., Tables of Molecular Vibrational Frequencies Consolidated Volume I, National Bureau of Standards, 1972, 1-160. [all data]