Cyanogen chloride (37ClCN)

Vibrational and/or electronic energy levels

Data compiled by: Takehiko Shimanouchi

Symmetry:   C∞ν     Symmetry Number σ = 1

 Sym.   No   Approximate   Selected Freq.  Infrared   Raman   Comments
 Species   type of mode   Value   Rating   Value  Phase  Value  Phase

σ+ 1 CN str 2215  A 2215.3 VS gas 2206 liq.
π 2 Bend 378  A 380 S gas 394 liq. RP
σ+ 3 CCl str 736  C gas 730 liq. FR(2ν2)

Source: Shimanouchi, 1972

References

Shimanouchi, 1972
Shimanouchi, T., Tables of Molecular Vibrational Frequencies Consolidated Volume I, National Bureau of Standards, 1972, 1-160. [all data]