Carbonyl sulfide (12C16O32S)

Vibrational and/or electronic energy levels

Data compiled by: Takehiko Shimanouchi

Symmetry:   C∞ν     Symmetry Number σ = 1

 Sym.   No   Approximate   Selected Freq.  Infrared   Raman   Comments
 Species   type of mode   Value   Rating   Value  Phase  Value  Phase

σ+ 1 CO str 2062  A 2062.22 gas 2050 W liq.
π 2 Bend 520  A 520.41 gas 521 W dp liq.
σ+ 3 CS str 859  B 858.95 gas 858 M p liq.

Source: Shimanouchi, 1972

References

Shimanouchi, 1972
Shimanouchi, T., Tables of Molecular Vibrational Frequencies Consolidated Volume I, National Bureau of Standards, 1972, 1-160. [all data]