Sulfur dioxide (32S16O2)

Vibrational and/or electronic energy levels

Data compiled by: Takehiko Shimanouchi

Symmetry:   C     Symmetry Number σ = 2

 Sym.   No   Approximate   Selected Freq.  Infrared   Raman   Comments
 Species   type of mode   Value   Rating   Value  Phase  Value  Phase

a1 1 Sym str 1151  B 1151.4 S gas 1150.5 S p gas
a1 2 Bend 518  B 517.7 S gas 524.5 W p liq.
b1 3 Anti str 1362  B 1361.8 S gas 1336 W dp liq.

Source: Shimanouchi, 1972

References

Shimanouchi, 1972
Shimanouchi, T., Tables of Molecular Vibrational Frequencies Consolidated Volume I, National Bureau of Standards, 1972, 1-160. [all data]