(HCO2H)4..HCO2 anion

Gas phase thermochemistry data

Data compiled by: John E. Bartmess

Quantity Value Units Method Reference Comment
Δfgas-2385. ± 22.kJ/molTherLuczynski, Wlodek, et al., 1978Buffer gas H2. There may be appreciable fractionation of neutral gases: Williamson, Knighton, et al., 1996

References

Luczynski, Wlodek, et al., 1978
Luczynski, Z.; Wlodek, S.; Wincel, H., Stabilities of HCOO-.(HCOOH)n and Cl-.(HCOOH)n clusters, Int. J. Mass Spectrom. Ion Phys., 1978, 26, 103. [all data]

Williamson, Knighton, et al., 1996
Williamson, D.H.; Knighton, W.B.; Grimsrud, E.P., Pulsed High Pressure Mass Spectrometry with Near-Viscous Flow Ion Sampling, Int. J. Mass Spectrom. Ion Proc., 1996, 154, 1-2, 15, https://doi.org/10.1016/0168-1176(96)04372-8 . [all data]