NNO2 anion

Gas phase thermochemistry data

Data compiled by: John E. Bartmess

Quantity Value Units Method Reference Comment
Δfgas93.22kJ/molTherLi and Continetti, 2002

Gas phase ion energetics data

Data compiled by: John E. Bartmess

Electron affinity of neutral species

EAneutral (eV) Method Reference Comment
3.351 ± 0.010LPESArnold and Neumark, 1995Anion: C2V NNO2-. Neutral: triplet. There are lower dissociation limits to O- + N2O

References

Li and Continetti, 2002
Li, R.J.; Continetti, R.E., Studies of the excited state dynamics of N2O2 by dissociative photodetachment of N2O2-, J. Phys. Chem. A, 2002, 106, 7, 1183-1189, https://doi.org/10.1021/jp013330u . [all data]

Arnold and Neumark, 1995
Arnold, D.W.; Neumark, D.M., Study of N2O2 by photoelectron spectroscopy of N2O2-, J. Chem. Phys., 1995, 102, 18, 7035, https://doi.org/10.1063/1.469097 . [all data]