2,6-diMe-4-CO2Me-nitrobenzene radical anion

Gas phase thermochemistry data

Data compiled by: John E. Bartmess

Quantity Value Units Method Reference Comment
Δfgas-478. ± 16.kJ/molR-EAMishima, Kang, et al., 1993ΔGea(343 K) = -27.0 kcal/mol; ΔSea (est) = -2.0 eu.

References

Mishima, Kang, et al., 1993
Mishima, M.; Kang, C.H.; Huh, C.; Fujio, M.; Tsuno, Y., Substituent Effect on Electron Affinity of 2,6-Dimethylnitrobenzene, Chem. Lett., 1993, 22, 5, 889, https://doi.org/10.1246/cl.1993.889 . [all data]