(D2O)4..DO anion

Gas phase thermochemistry data

Data compiled by: John E. Bartmess

Quantity Value Units Method Reference Comment
Δfgas-340.3 ± 1.9kcal/molTherArshadi and Kebarle, 1970

References

Arshadi and Kebarle, 1970
Arshadi, M.; Kebarle, P., Hydration of OH- and O2- in the Gas Phase. Comparative Solvation of OH- by Water and the Hydrogen Halides. Effect of Acidity, J. Phys. Chem., 1970, 74, 7, 1483, https://doi.org/10.1021/j100702a015 . [all data]