Tetracyanoethylene anion

Reaction thermochemistry data

Data compiled by: John E. Bartmess

Individual Reactions

Tetracyanoethylene anion = C6H2N4O-

By formula: C6N4- = C6H2N4O-

Quantity Value Units Method Reference Comment
Δr34. ± 4.6kJ/molN/AKhuseynov, Fontana, et al., 2012gas phase

References

Khuseynov, Fontana, et al., 2012
Khuseynov, D.; Fontana, M.T.; Sanov, A., Photoelectron spectroscopy and photochemistry of tetracyanoethylene radical anion in the gas phase, Chem. Phys. Lett., 2012, 550, 15-18, https://doi.org/10.1016/j.cplett.2012.08.035 . [all data]