Naphthalene anion

Gas phase thermochemistry data

Data compiled by: John E. Bartmess

Quantity Value Units Method Reference Comment
Δfgas32.8 ± 1.2kcal/molR-EAZlatkis, Lee, et al., 1983However, see Heinis, Chowdhury, et al., 1993 for a discussion; it may not be bound.

References

Zlatkis, Lee, et al., 1983
Zlatkis, A.; Lee, C.K.; Wentworth, W.E.; Chen, E.C.M., Constant current linearization for determination of electron capture mechanisms, Anal. Chem., 1983, 55, 1596. [all data]

Heinis, Chowdhury, et al., 1993
Heinis, T.; Chowdhury, S.; Kebarle, P., Electron Affinities of Naphthalene, Anthracene and Substituted Naphthalenes and Anthracenes, Org. Mass Spectrom., 1993, 28, 4, 358, https://doi.org/10.1002/oms.1210280416 . [all data]