(MeCN)3..F anion

Gas phase thermochemistry data

Data compiled by: John E. Bartmess

Quantity Value Units Method Reference Comment
Δfgas-62.8 ± 2.7kcal/molTherHiraoka, Mizuse, et al., 1988
Δfgas-59.37kcal/molTherYamdagni and Kebarle, 1972

References

Hiraoka, Mizuse, et al., 1988
Hiraoka, K.; Mizuse, S.; Yamabe, S., Solvation of Halide Ions with H2O and CH3CN in the Gas Phase, J. Phys. Chem., 1988, 92, 13, 3943, https://doi.org/10.1021/j100324a051 . [all data]

Yamdagni and Kebarle, 1972
Yamdagni, R.; Kebarle, P., Solvation of negative ions by protic and aprotic solvents. Gas phase solvation of halide ions by acetonitrile and water molecules, J. Am. Chem. Soc., 1972, 94, 2940. [all data]