(H2O)7..F anion

Gas phase thermochemistry data

Data compiled by: John E. Bartmess

Quantity Value Units Method Reference Comment
Δfgas-573.5 ± 1.1kcal/molTherHiraoka, Mizuse, et al., 1988

References

Hiraoka, Mizuse, et al., 1988
Hiraoka, K.; Mizuse, S.; Yamabe, S., Solvation of Halide Ions with H2O and CH3CN in the Gas Phase, J. Phys. Chem., 1988, 92, 13, 3943, https://doi.org/10.1021/j100324a051 . [all data]