(Me2CO)3..Cl anion

Gas phase thermochemistry data

Data compiled by: John E. Bartmess

Quantity Value Units Method Reference Comment
Δfgas-1029.3kJ/molTherHiraoka, Takimoto, et al., 1986Entropy estimated

References

Hiraoka, Takimoto, et al., 1986
Hiraoka, K.; Takimoto, H.; Morise, K.; Shoda, T.; Nakamura, S., Ion-Molecule Reactions in Gaseous Acetone, Bull. Chem. Soc. Japan, 1986, 59, 7, 2247, https://doi.org/10.1246/bcsj.59.2247 . [all data]