p-Fluorobenzaldehyde anion

Gas phase thermochemistry data

Data compiled by: John E. Bartmess

Quantity Value Units Method Reference Comment
Δfgas-277. ± 4.6kJ/molR-EAWentworth, Kao, et al., 1975

References

Wentworth, Kao, et al., 1975
Wentworth, W.E.; Kao, L.W.; Becker, R.S., Electron affinities of substituted aromatic compounds, J. Phys. Chem., 1975, 79, 1161. [all data]