(HCN)2..CN anion

Gas phase thermochemistry data

Data compiled by: John E. Bartmess

Quantity Value Units Method Reference Comment
Δfgas171. ± 5.9kJ/molTherMeot-ner, Cybulski, et al., 1988

References

Meot-ner, Cybulski, et al., 1988
Meot-ner, M.; Cybulski, S.M.; Scheiner, S.; Liebman, J.F., Is CN- Significantly Anisotropic? Comparison of CN- vs. Cl-: Clustering with HCN and Condensed Phase Thermochemistry, J. Phys. Chem., 1988, 92, 10, 2738, https://doi.org/10.1021/j100321a009 . [all data]