(H2O)4..Br anion

Gas phase thermochemistry data

Data compiled by: John E. Bartmess

Quantity Value Units Method Reference Comment
Δfgas-1375.4kJ/molTherHiraoka, Mizuse, et al., 1988
Δfgas-1355.3kJ/molTherMarkovich, Pollack, et al., 1994For photodissociation plus electron loss. Affinity is difference from lower solvated ion.
Δfgas-1375.0kJ/molTherArshadi, Yamdagni, et al., 1970

References

Hiraoka, Mizuse, et al., 1988
Hiraoka, K.; Mizuse, S.; Yamabe, S., Solvation of Halide Ions with H2O and CH3CN in the Gas Phase, J. Phys. Chem., 1988, 92, 13, 3943, https://doi.org/10.1021/j100324a051 . [all data]

Markovich, Pollack, et al., 1994
Markovich, G.; Pollack, S.; Giniger, R.; Cheshnovsky, O., Photoelectron spectroscopy of Cl-, Br-, and I- solvated in water clusters, J. Chem. Phys., 1994, 101, 11, 9344, https://doi.org/10.1063/1.467965 . [all data]

Arshadi, Yamdagni, et al., 1970
Arshadi, M.; Yamdagni, R.; Kebarle, P., Hydration of Halide Negative Ions in the Gas Phase. II. Comparison of Hydration Energies for the Alkali Positive and Halide Negative Ions, J. Phys. Chem., 1970, 74, 7, 1475, https://doi.org/10.1021/j100702a014 . [all data]