(H2O)11..I anion

Gas phase thermochemistry data

Data compiled by: John E. Bartmess

Quantity Value Units Method Reference Comment
Δfgas-3115.7kJ/molTherMarkovich, Pollack, et al., 1994For photodissociation plus electron loss. Affinity is difference from lower solvated ion.

Gas phase ion energetics data

Data compiled by: John E. Bartmess

Electron affinity of neutral species

EAneutral (eV) Method Reference Comment
5.49 ± 0.10LPESMarkovich, Pollack, et al., 1994For photodissociation plus electron loss. Affinity is difference from lower solvated ion.

References

Markovich, Pollack, et al., 1994
Markovich, G.; Pollack, S.; Giniger, R.; Cheshnovsky, O., Photoelectron spectroscopy of Cl-, Br-, and I- solvated in water clusters, J. Chem. Phys., 1994, 101, 11, 9344, https://doi.org/10.1063/1.467965 . [all data]