tBuCH(Me)OH..F anion

Gas phase thermochemistry data

Data compiled by: John E. Bartmess

Quantity Value Units Method Reference Comment
Δfgas-745.04kJ/molTherMihalick, Gatev, et al., 1996affinity derived using a ROH..F. neutral binding energy of 10.3 kcal/mol.

Gas phase ion energetics data

Data compiled by: John E. Bartmess

Electron affinity of neutral species

EAneutral (eV) Method Reference Comment
3.040 ± 0.022LPDMihalick, Gatev, et al., 1996affinity derived using a ROH..F. neutral binding energy of 10.3 kcal/mol.

References

Mihalick, Gatev, et al., 1996
Mihalick, J.E.; Gatev, G.G.; Brauman, J.I., Electron Photodetachment Spectroscopy of Solvated Anions: RO.HF- or ROH.F-?, J. Am. Chem. Soc., 1996, 118, 49, 12424, https://doi.org/10.1021/ja954202k . [all data]