Pyrazine anion

Gas phase thermochemistry data

Data compiled by: John E. Bartmess

Quantity Value Units Method Reference Comment
Δfgas<201.7kJ/molR-EANenner and Schultz, 1975Pyrazine. EA estimated as 0.124 eV based on soln phase electrochemical correlations. G3MP2B3 calculations put EA ca. 0 eV

References

Nenner and Schultz, 1975
Nenner, I.; Schultz, G.J., Temporary negative ions and electron affinities of benzene and N-heterocyclic molecules: Pyridine, pyridazine, pyrimidine, pyrazine, and s-triazine, J. Chem. Phys., 1975, 62, 1747. [all data]