cyclopentadienone radical anion

Gas phase thermochemistry data

Data compiled by: John E. Bartmess

Quantity Value Units Method Reference Comment
Δfgas84. ± 21.kJ/molNBAECooper, Naff, et al., 1975From benzoquinone. Possibly cyclopentadienone-.; but that anion is calculated to be ca 30 kcal/mol more stable

References

Cooper, Naff, et al., 1975
Cooper, C.D.; Naff, W.T.; Compton, R.N., Negative ion properties of p-benzoquinone: Electron affinity and compound states, J. Chem. Phys., 1975, 63, 2752. [all data]