Ag11 anion

Gas phase ion energetics data

Data compiled by: John E. Bartmess

Electron affinity of neutral species

EAneutral (eV) Method Reference Comment
2.180 ± 0.050LPESHandschuh, Cha, et al., 1995EA given is Vertical Detachment Energy. Adiabatic EA est as up to 1 eV smaller
2.64 ± 0.20LPESTaylor, Pettiettehall, et al., 1992EA set as 0.2 eV above onset to correct for unresolved hot bands.
2.10 ± 0.20LPESGanteför, Gausa, et al., 1990EA: threshold, ≥EA(adiabatic). Vertical Detachment Energy: 2.51±0.1 eV.

References

Handschuh, Cha, et al., 1995
Handschuh, H.; Cha, C.Y.; Bechthold, P.S.; Gantefor, G.; Eberhardt, W., Electronic shells or molecular orbitals: Photoelectron spectra of Ag-n(-) clusters, J. Chem. Phys., 1995, 102, 16, 6406, https://doi.org/10.1063/1.469356 . [all data]

Taylor, Pettiettehall, et al., 1992
Taylor, K.J.; Pettiettehall, C.L.; Cheshnovsky, O.; Smalley, R.E., Ultraviolet Photoelectron Spectra of Coinage Metal Clusters, J. Chem. Phys., 1992, 96, 4, 3319, https://doi.org/10.1063/1.461927 . [all data]

Ganteför, Gausa, et al., 1990
Ganteför, G.; Gausa, M.; Meiwes-Broer, K.-H.; Lutz, H.O., Photoelectron Spectroscopy of Silver and Palladium Cluster Anions, J. Chem. Soc. Farad. Trans., 1990, 86, 13, 2483, https://doi.org/10.1039/ft9908602483 . [all data]