lithium bromide anion

Gas phase thermochemistry data

Data compiled by: John E. Bartmess

Quantity Value Units Method Reference Comment
Δfgas-218. ± 9.2kJ/molR-EAMiller, Leopold, et al., 1986Extrapolated by polarizability and radius from experimental data.

References

Miller, Leopold, et al., 1986
Miller, T.M.; Leopold, D.G.; Murray, K.K.; Lineberger, W.C., Electron Affinities of the Alkali Halides and the Structure of their Negative Ions, J. Chem. Phys., 1986, 85, 5, 2368, https://doi.org/10.1063/1.451091 . [all data]