Si3C3 radical anion

Gas phase ion energetics data

Data compiled by: John E. Bartmess

Electron affinity of neutral species

EAneutral (eV) Method Reference Comment
2.040 ± 0.080LPESNakajima, Taguwa, et al., 1995Vertical Detachment Energy: 2.16±0.08 eV

References

Nakajima, Taguwa, et al., 1995
Nakajima, A.; Taguwa, T.; Nakao, K.; Gomei, M.; Kishi, R.; Iwata, S.; Kaya, K., Photoelectron Spectroscopy of silicon-carbon cluster Anions (SinCm-), J. Chem. Phys., 1995, 103, 6, 2050, https://doi.org/10.1063/1.469731 . [all data]