SiC3 radical anion

Gas phase ion energetics data

Data compiled by: John E. Bartmess

Electron affinity of neutral species

EAneutral (eV) Method Reference Comment
2.8270 ± 0.0070LPESDavico, Schwartz, et al., 2001
2.640 ± 0.060LPESNakajima, Taguwa, et al., 1995Vertical Detachment Energy: 2.76±0.04 eV. Linear form.
1.72 ± 0.15LPESNakajima, Taguwa, et al., 1995Vertical Detachment Energy: 1.93±0.10 eV. Cyclic form.

References

Davico, Schwartz, et al., 2001
Davico, G.E.; Schwartz, R.L.; Lineberger, W.C., Photoelectron spectroscopy of C3Si and C4Si2 anions, J. Chem. Phys., 2001, 115, 4, 1789-1794, https://doi.org/10.1063/1.1380713 . [all data]

Nakajima, Taguwa, et al., 1995
Nakajima, A.; Taguwa, T.; Nakao, K.; Gomei, M.; Kishi, R.; Iwata, S.; Kaya, K., Photoelectron Spectroscopy of silicon-carbon cluster Anions (SinCm-), J. Chem. Phys., 1995, 103, 6, 2050, https://doi.org/10.1063/1.469731 . [all data]