(CO2)5..CO3 radical anion

Reaction thermochemistry data

Data compiled by: John E. Bartmess

Individual Reactions

C5O11- + 5Carbon dioxide = C6O13-

By formula: C5O11- + 5CO2 = C6O13-

Quantity Value Units Method Reference Comment
Δr20. ± 4.2kJ/molTDAsHiraoka and Yamabe, 1992gas phase
Quantity Value Units Method Reference Comment
Δr-7.5 ± 4.2kJ/molTDAsHiraoka and Yamabe, 1992gas phase

C6O13- + 6Carbon dioxide = C7O15-

By formula: C6O13- + 6CO2 = C7O15-

Quantity Value Units Method Reference Comment
Δr20. ± 4.2kJ/molTDAsHiraoka and Yamabe, 1992gas phase
Quantity Value Units Method Reference Comment
Δr-7.9 ± 4.2kJ/molTDAsHiraoka and Yamabe, 1992gas phase

References

Hiraoka and Yamabe, 1992
Hiraoka, K.; Yamabe, S., Formation of the Chelate Bonds in the Cluster O2(-)(CO2)n, CO3(-)(CO2)n, and NO2(-)(CO2)n, J. Chem. Phys., 1992, 97, 1, 643, https://doi.org/10.1063/1.463560 . [all data]