pI-C6H4CH2 anion

Gas phase ion energetics data

Data compiled by: John E. Bartmess

Electron affinity of neutral species

EAneutral (eV) Method Reference Comment
1.18 ± 0.16D-EAWenthold, Wierschke, et al., 1994Between MeCN and FCH2CH2OH

Protonation reactions

C7H6I- + Hydrogen cation = Benzene, 1-iodo-4-methyl-

By formula: C7H6I- + H+ = C7H7I

Quantity Value Units Method Reference Comment
Δr372.3 ± 3.1kcal/molG+TSWenthold, Wierschke, et al., 1994gas phase; Between MeCN and FCH2CH2OH
Quantity Value Units Method Reference Comment
Δr365.0 ± 3.0kcal/molIMRBWenthold, Wierschke, et al., 1994gas phase; Between MeCN and FCH2CH2OH

References

Wenthold, Wierschke, et al., 1994
Wenthold, P.G.; Wierschke, S.G.; Nash, J.J.; Squires, R.R., Biradical thermochemistry from collision-induced dissociation threshold energy measurements .2. Experimental and theoretical studies of the Mechanism and Thermochemistry of Formation of alph, J. Am. Chem. Soc., 1994, 116, 16, 7378, https://doi.org/10.1021/ja00095a048 . [all data]